Archives

Windows System Error Code 1342 – ERROR_SERVER_NOT_DISABLED (0x53E)]

In this post, you’ll learn about the Windows System Error ERROR_SERVER_NOT_DISABLED (0x53E)] and the reason why you are receiving the error message How does this Error in Windows Look like? Error Code 1342 ERROR_SERVER_NOT_DISABLED (0x53E)] Why do you receive the System Error Error Code 1342 ERROR_SERVER_NOT_DISABLED (0x53E)] in Windows? The server is currently enabled.

InterSystems Cache & Ensemble Error 6254 – Tag expected, XML input, %1, is not in proper format as chil

In this blog post, let’s learn about the error message “6254 Tag expected, XML input, %1, is not in proper format as chil” in InterSystems Cache & Ensemble and the description of the error message. Error Message 6254 – Tag expected, XML input, %1, is not in proper format as chil Error Details Tag expected, XML input, %1, is not in proper format as child…

InterSystems Cache & Ensemble Error 278 – Level %1 possibly has an infinite loop, pointer block %2’s r

In this blog post, let’s learn about the error message “278 Level %1 possibly has an infinite loop, pointer block %2’s r” in InterSystems Cache & Ensemble and the description of the error message. Error Message 278 – Level %1 possibly has an infinite loop, pointer block %2’s r Error Details Level %1 possibly has an infinite loop, pointer block %2’s right link %3 seen…

Stripe API Error – charge_disputed

In this post, you’ll learn more about the Error charge_disputed that is returned when working with the Stripe API Stripe API Error charge_disputed Stripe API Error Description The charge you’re attempting to refund has been charged back. Check the disputes documentation to learn how to respond to the dispute.

How to fix the Oracle error JMS-00146: Registration failed?

In this post, you’ll learn more about the Oracle ErrorJMS-00146: Registration failed with the details on why you receive this error and the possible solution to fix it. Oracle Error Description JMS-00146: Registration failed Reason for the Error JMS-00146: Registration failed Cause: An error occured while registering the type in the type map How to fix the Error JMS-00146: Registration failed ? You can fix…

How to fix the Oracle error RMAN-06456: command is obsolete?

In this post, you’ll learn more about the Oracle ErrorRMAN-06456: command is obsolete with the details on why you receive this error and the possible solution to fix it. Oracle Error Description RMAN-06456: command is obsolete Reason for the Error RMAN-06456: command is obsolete This is an informational message only. How to fix the Error RMAN-06456: command is obsolete ? You can fix this error…

How to fix the Oracle error KUP-04062: no data source specified?

In this post, you’ll learn more about the Oracle ErrorKUP-04062: no data source specified with the details on why you receive this error and the possible solution to fix it. Oracle Error Description KUP-04062: no data source specified Reason for the Error KUP-04062: no data source specified No location for the data source of the external table was specified when the external table was created….

How to fix the Oracle error ORA-16798: unable to complete recovery during failover?

In this post, you’ll learn more about the Oracle ErrorORA-16798: unable to complete recovery during failover with the details on why you receive this error and the possible solution to fix it. Oracle Error Description ORA-16798: unable to complete recovery during failover Reason for the Error ORA-16798: unable to complete recovery during failover The physical standby database could not complete recovery during failover. How to…

Windows System Error Code 8625 – ERROR_DS_AUDIT_FAILURE (0x21B1)]

In this post, you’ll learn about the Windows System Error ERROR_DS_AUDIT_FAILURE (0x21B1)] and the reason why you are receiving the error message How does this Error in Windows Look like? Error Code 8625 ERROR_DS_AUDIT_FAILURE (0x21B1)] Why do you receive the System Error Error Code 8625 ERROR_DS_AUDIT_FAILURE (0x21B1)] in Windows? A required audit event could not be generated for the operation.

Windows System Error Code 1647 – ERROR_UNKNOWN_PATCH (0x66F)]

In this post, you’ll learn about the Windows System Error ERROR_UNKNOWN_PATCH (0x66F)] and the reason why you are receiving the error message How does this Error in Windows Look like? Error Code 1647 ERROR_UNKNOWN_PATCH (0x66F)] Why do you receive the System Error Error Code 1647 ERROR_UNKNOWN_PATCH (0x66F)] in Windows? The update is not applied to this product.

What are the Different Resolutions that Windows Phone 8 Supports ?

The Windows Phone 8 supports 3 different resolutions which includes WVGA with 480 X 800 pixels and scale factor of 1.0. WXGA with 768 X 1280 pixels and scale factor of 1.6. HD720P with 720 X 1280 pixels and scale factor of 1.5. The WVGA with 480 X 800 was already supported in Windows Phone 7.8 and earlier version and the other 2 resolutions are…

InfoSphere Information Server Error – DSJE_WRONGJOB – -6

In this post, you’ll learn more about the Error DSJE_WRONGJOB – -6that is returned when working with the InfoSphere Information Server InfoSphere Information Server DSJE_WRONGJOB Error Description Job for this JobHandle was not started from a call to DSRunJob by the current process.

IBM Sterling B2B Integrator SWIFT Error Code – TransactionCreditDebitIndicatorRule – 1745

In this post, you’ll learn more about the SWIFT Error TransactionCreditDebitIndicatorRule – 1745that is returned when working with the IBM Sterling B2B Integrator IBM Sterling B2B Integrator SWIFT Error Code TransactionCreditDebitIndicatorRule Error Description If CreditDebitIndicator is present, then at least one or more Message Elements in the list (AccountEntry/EntryAmount, Payment/InstructedAmount, Payment/InterbankSettlementAmount) must be present. If CreditDebitIndicator is not present, then any Message Elements in the…