Archives
How to fix the Oracle error CRS-00700: Oracle High Availability Service aborted due to failure to allocate memory. Details at...
In this post, you’ll learn more about the Oracle ErrorCRS-00700: Oracle High Availability Service aborted due to failure to allocate memory. Details at string in string. with the details on why you receive this error and the possible solution to fix it. Oracle Error Description CRS-00700: Oracle High Availability Service aborted due to failure to allocate memory. Details at string in string. Reason for the…
How to fix the Oracle error ORA-55460: incorrect usage of semantic operators?
In this post, you’ll learn more about the Oracle ErrorORA-55460: incorrect usage of semantic operators with the details on why you receive this error and the possible solution to fix it. Oracle Error Description ORA-55460: incorrect usage of semantic operators Reason for the Error ORA-55460: incorrect usage of semantic operators There was a syntax error in the call to the SEM_RELATED operator How to fix…
How to fix the Oracle error ORA-47322: error creating Rule string, string?
In this post, you’ll learn more about the Oracle ErrorORA-47322: error creating Rule string, string with the details on why you receive this error and the possible solution to fix it. Oracle Error Description ORA-47322: error creating Rule string, string Reason for the Error ORA-47322: error creating Rule string, string An unexpected error occurred creating the rule How to fix the Error ORA-47322: error creating…
How to fix the Oracle error ORA-22914: DROP of nested tables not supported?
In this post, you’ll learn more about the Oracle ErrorORA-22914: DROP of nested tables not supported with the details on why you receive this error and the possible solution to fix it. Oracle Error Description ORA-22914: DROP of nested tables not supported Reason for the Error ORA-22914: DROP of nested tables not supported Attempted to DROP a nested table. How to fix the Error ORA-22914:…
How to fix the Oracle error ORA-21702: object is not instantiated or has been de-instantiated in cache?
In this post, you’ll learn more about the Oracle ErrorORA-21702: object is not instantiated or has been de-instantiated in cache with the details on why you receive this error and the possible solution to fix it. Oracle Error Description ORA-21702: object is not instantiated or has been de-instantiated in cache Reason for the Error ORA-21702: object is not instantiated or has been de-instantiated in cache…
How to fix the Oracle error ORA-19647: non-zero LEVEL cannot be specified when INCREMENTAL is FALSE?
In this post, you’ll learn more about the Oracle ErrorORA-19647: non-zero LEVEL cannot be specified when INCREMENTAL is FALSE with the details on why you receive this error and the possible solution to fix it. Oracle Error Description ORA-19647: non-zero LEVEL cannot be specified when INCREMENTAL is FALSE Reason for the Error ORA-19647: non-zero LEVEL cannot be specified when INCREMENTAL is FALSE BACKUPSETDATAFILE was called…
How to fix the error ORA-00137: invalid LISTENER_NETWORKS specification with NAME=string?
In this post, you’ll learn more about the Oracle ErrorORA-00137: invalid LISTENER_NETWORKS specification with NAME=string with the details on why you receive this error and the possible solution to fix it. Oracle Error Description ORA-00137: invalid LISTENER_NETWORKS specification with NAME=string Reason for the Error ORA-00137: invalid LISTENER_NETWORKS specification with NAME=string The syntax for the LISTENER_NETWORKS specification with the indicated NAME was invalid. How to fix…
SQL Server Error Code – 25024 a snapshot storage option of ‘database’
In this blog post, you’ll learn more about the SQL Server Error Code 25024 and the error message description that is shown SQL Server Error Code 25024 SQL Server Error Description for the Code :25024 A snapshot storage option of ‘database’ is incompatible with the use of character mode bcp for snapshot generation.
SQL Server Error Code – 21705 microsoft sql server download only confl
In this blog post, you’ll learn more about the SQL Server Error Code 21705 and the error message description that is shown SQL Server Error Code 21705 SQL Server Error Description for the Code :21705 Microsoft SQL Server Download Only Conflict Resolver
SQL Server Error Code – 13019 a select into statement
In this blog post, you’ll learn more about the SQL Server Error Code 13019 and the error message description that is shown SQL Server Error Code 13019 SQL Server Error Description for the Code :13019 a SELECT INTO statement
SQL Server Error Code – 3864 could not find an entry for index with i
In this blog post, you’ll learn more about the SQL Server Error Code 3864 and the error message description that is shown SQL Server Error Code 3864 SQL Server Error Description for the Code :3864 Could not find an entry for index with ID %d on object with ID %d in database with ID %d. Possible schema corruption. Run DBCC CHECKDB.
SQL Server Error Code – 3760 cannot drop index ?%.*ls? on view ?%.*ls
In this blog post, you’ll learn more about the SQL Server Error Code 3760 and the error message description that is shown SQL Server Error Code 3760 SQL Server Error Description for the Code :3760 Cannot drop index ?%.*ls? on view ?%.*ls? that has SNAPSHOT_MATERIALIZATION.
InterSystems IRIS Productios Error Code – MaxApplicationContextCountExceeded
In this post, you’ll learn about the Productions related Error Code MaxApplicationContextCountExceeded in InterSystems IRIS database the reason why you are receiving it Error Code : MaxApplicationContextCountExceeded Reason for the Error code MaxApplicationContextCountExceeded in InterSystems IRIS DBMS Maximum number of Application Context items exceeded
InterSystems IRIS General Error Code – 5470
In this post, you’ll learn about the General error code 5470 in InterSystems IRIS database the reason why you are receiving the error message when using the InterSystems IRIS data platform Error Code : 5470 Reason for the Error code 5470 in InterSystems IRIS DBMS Id, Primary Key and Unique indices cannot override collation: %1
InterSystems Cache & Ensemble Error 8036 – No metadata field specified
In this blog post, let’s learn about the error message “8036 No metadata field specified” in InterSystems Cache & Ensemble and the description of the error message. Error Message 8036 – No metadata field specified Error Details No metadata field specified
IBM Sterling B2B Integrator SWIFT Error Code – TotalAmountYearToDateRule – 1723
In this post, you’ll learn more about the SWIFT Error TotalAmountYearToDateRule – 1723that is returned when working with the IBM Sterling B2B Integrator IBM Sterling B2B Integrator SWIFT Error Code TotalAmountYearToDateRule Error Description PEPOrISAOrPortfolioTransferCancellation RequestV02, PEPOrISAOrPortfolioTransfer ConfirmationV02, PEPOrISAOrPortfolio TransferInstructionV02, PEPOrISAOr PortfolioInformationV01: TotalAmountYearToDate must be equal to the sum of EquityComponent and CashComponent if present.
How to fix the Oracle error ORA-55465: resource position string not secured with OLS policy?
In this post, you’ll learn more about the Oracle ErrorORA-55465: resource position string not secured with OLS policy with the details on why you receive this error and the possible solution to fix it. Oracle Error Description ORA-55465: resource position string not secured with OLS policy Reason for the Error ORA-55465: resource position string not secured with OLS policy An attempt was made to associate…
How to fix the Oracle error ORA-02852: Invalid critical-section time out value?
In this post, you’ll learn more about the Oracle ErrorORA-02852: Invalid critical-section time out value with the details on why you receive this error and the possible solution to fix it. Oracle Error Description ORA-02852: Invalid critical-section time out value Reason for the Error ORA-02852: Invalid critical-section time out value The time given was not a positive number. How to fix the Error ORA-02852: Invalid…
SQL Server Error Code – 46542 %s_msg statement failed. one or more err
In this blog post, you’ll learn more about the SQL Server Error Code 46542 and the error message description that is shown SQL Server Error Code 46542 SQL Server Error Description for the Code :46542 %S_MSG statement failed. One or more errors occurred while executing the statement. %s