Archives
How to fix the Oracle error ORA-39825: Direct path load of view or synonym (string.string) with multiple dependencies not permitted.?
In this post, you’ll learn more about the Oracle ErrorORA-39825: Direct path load of view or synonym (string.string) with multiple dependencies not permitted. with the details on why you receive this error and the possible solution to fix it. Oracle Error Description ORA-39825: Direct path load of view or synonym (string.string) with multiple dependencies not permitted. Reason for the Error ORA-39825: Direct path load of…
How to fix the Oracle error ORA-27616: ASM Allocation Unit: string?
In this post, you’ll learn more about the Oracle ErrorORA-27616: ASM Allocation Unit: string with the details on why you receive this error and the possible solution to fix it. Oracle Error Description ORA-27616: ASM Allocation Unit: string Reason for the Error ORA-27616: ASM Allocation Unit: string This error message is usually accompanied by another message, indicating the real problem. This message exists to provide…
How to fix the Oracle error ORA-24082: propagation may still be happening for the schedule for QUEUE string and DESTINATION...
In this post, you’ll learn more about the Oracle ErrorORA-24082: propagation may still be happening for the schedule for QUEUE string and DESTINATION string with the details on why you receive this error and the possible solution to fix it. Oracle Error Description ORA-24082: propagation may still be happening for the schedule for QUEUE string and DESTINATION string Reason for the Error ORA-24082: propagation may…
C# Compiler Error – CS0838 an expression tree may not contain a mul
In this blog post, you’ll learn more about the C# Compiler Error – CS0838 and the related message description C# Compiler Error Code CS0838 C# Compiler Description for the Code :CS0838 An expression tree may not contain a multidimensional array initializer
SQL Server Error Code – 26034 the sql server network interface library
In this blog post, you’ll learn more about the SQL Server Error Code 26034 and the error message description that is shown SQL Server Error Code 26034 SQL Server Error Description for the Code :26034 The SQL Server Network Interface library was unable to execute polite termination due to outstanding connections. It will proceed with immediate termination.
SQL Server Error Code – 22208 access to dw tiered storage columnstore
In this blog post, you’ll learn more about the SQL Server Error Code 22208 and the error message description that is shown SQL Server Error Code 22208 SQL Server Error Description for the Code :22208 Access to DW Tiered Storage ColumnStore blob failed. See earlier errors for cause.
SQL Server Error Code – 19415 failed to process the registry key value
In this blog post, you’ll learn more about the SQL Server Error Code 19415 and the error message description that is shown SQL Server Error Code 19415 SQL Server Error Description for the Code :19415 Failed to process the registry key value ‘%.*ls’ (Windows error code: %d), which holds the name of the remote Windows Server Failover Clustering (WSFC) cluster. For more information about this…
SQL Server Error Code – 16303 ‘%.*ls’ is not a feature than can be res
In this blog post, you’ll learn more about the SQL Server Error Code 16303 and the error message description that is shown SQL Server Error Code 16303 SQL Server Error Description for the Code :16303 ‘%.*ls’ is not a feature than can be restricted.
SQL Server Error Code – 3174 the file ?%ls? cannot be moved by this r
In this blog post, you’ll learn more about the SQL Server Error Code 3174 and the error message description that is shown SQL Server Error Code 3174 SQL Server Error Description for the Code :3174 The file ?%ls? cannot be moved by this RESTORE operation.
SQL Server Error Code – 2396 %sattribute may not appear outside of an
In this blog post, you’ll learn more about the SQL Server Error Code 2396 and the error message description that is shown SQL Server Error Code 2396 SQL Server Error Description for the Code :2396 %sAttribute may not appear outside of an element
InterSystems IRIS TSQL Code 4926 ALTER TABLE ALTER COLUMN DROP ROWGUIDCOL
In this post, you’ll learn about the SQL error code 4926 in InterSystems IRIS database the reason why you are receiving the TSQL message when using the InterSystems IRIS data platform Error Code : 4926 Reason for the Error code 4926 in InterSystems IRIS DBMS ALTER TABLE ALTER COLUMN DROP ROWGUIDCOL failed because a column does not exist in table ‘%.*ls’ with ROWGUIDCOL property.
InterSystems Cache & Ensemble Error 6610 – ClassList must be specified in projection or in calling this
In this blog post, let’s learn about the error message “6610 ClassList must be specified in projection or in calling this” in InterSystems Cache & Ensemble and the description of the error message. Error Message 6610 – ClassList must be specified in projection or in calling this Error Details ClassList must be specified in projection or in calling this routine. ClassList must not be empty.
InterSystems Cache & Ensemble Error 2056 – Virtual IP for mirror %1 is not a valid address ‘%2’
In this blog post, let’s learn about the error message “2056 Virtual IP for mirror %1 is not a valid address ‘%2′” in InterSystems Cache & Ensemble and the description of the error message. Error Message 2056 – Virtual IP for mirror %1 is not a valid address ‘%2’ Error Details Virtual IP for mirror %1 is not a valid address ‘%2’
IBM FlashSystem V9000 Error – 1404 – 087002
In this post, you’ll learn more about the Error 1404 – 087002that is returned when working with the IBM FlashSystem V9000 IBM FlashSystem V9000 Error Code 1404 Error Description Cloud gateway service restarted too often
How to fix the Oracle error IMG-00723: missing value in SHARPEN operation?
In this post, you’ll learn more about the Oracle ErrorIMG-00723: missing value in SHARPEN operation with the details on why you receive this error and the possible solution to fix it. Oracle Error Description IMG-00723: missing value in SHARPEN operation Reason for the Error IMG-00723: missing value in SHARPEN operation Cause: An incorrect number of values was used to specify the sharpen parameters. How to…
How to fix the Oracle error TNS-12551: TNS:missing keyword?
In this post, you’ll learn more about the Oracle ErrorTNS-12551: TNS:missing keyword with the details on why you receive this error and the possible solution to fix it. Oracle Error Description TNS-12551: TNS:missing keyword Reason for the Error TNS-12551: TNS:missing keyword Cause: The supplied connect descriptor is missing one or more TNS keywords. How to fix the Error TNS-12551: TNS:missing keyword ? You can fix…
How to fix the Oracle error ORA-54607: CREATE_PC: error fetching data from input points table?
In this post, you’ll learn more about the Oracle ErrorORA-54607: CREATE_PC: error fetching data from input points table with the details on why you receive this error and the possible solution to fix it. Oracle Error Description ORA-54607: CREATE_PC: error fetching data from input points table Reason for the Error ORA-54607: CREATE_PC: error fetching data from input points table An internal read error occurred during…
How to fix the Oracle error ORA-39018: master process received invalid message number string?
In this post, you’ll learn more about the Oracle ErrorORA-39018: master process received invalid message number string with the details on why you receive this error and the possible solution to fix it. Oracle Error Description ORA-39018: master process received invalid message number string Reason for the Error ORA-39018: master process received invalid message number string Internal Error How to fix the Error ORA-39018: master…
How to fix the Oracle error ORA-36648: (XSDUNION09) Concat dimension workspace object is already defined as UNIQUE.?
In this post, you’ll learn more about the Oracle ErrorORA-36648: (XSDUNION09) Concat dimension workspace object is already defined as UNIQUE. with the details on why you receive this error and the possible solution to fix it. Oracle Error Description ORA-36648: (XSDUNION09) Concat dimension workspace object is already defined as UNIQUE. Reason for the Error ORA-36648: (XSDUNION09) Concat dimension workspace object is already defined as UNIQUE….