Archives
Apache Derby DB Error Code X0Y78 – .executeQuery() was called but no result set was retu
In this blog post, let’s learn about the error message “X0Y78- .executeQuery() was called but no result set was retu” in Apache Derby Database and the description of the error. Error Message X0Y78- .executeQuery() was called but no result set was retu Error Details .executeQuery() was called but no result set was returned. Use .executeUpdate() for non-queries.
Apache Derby DB Error Code 42508 – User ‘‘ can not create schema ‘
In this blog post, let’s learn about the error message “42508- User ‘‘ can not create schema ‘“ in Apache Derby Database and the description of the error. Error Message 42508- User ‘‘ can not create schema ‘ Error Details User ‘‘ can not create schema ‘‘. Only database owner could issue this statement.
IBM FlashSystem V9000 Error – 1187 – 074574
In this post, you’ll learn more about the Error 1187 – 074574that is returned when working with the IBM FlashSystem V9000 IBM FlashSystem V9000 Error Code 1187 Error Description Node software is damaged
How to fix the Oracle error DRG-13201: KOREAN_LEXER is desupported?
In this post, you’ll learn more about the Oracle ErrorDRG-13201: KOREAN_LEXER is desupported with the details on why you receive this error and the possible solution to fix it. Oracle Error Description DRG-13201: KOREAN_LEXER is desupported Reason for the Error DRG-13201: KOREAN_LEXER is desupported Cause: Using lexer type KOREAN_LEXER which is desupported. How to fix the Error DRG-13201: KOREAN_LEXER is desupported ? You can fix…
How to fix the Oracle error PCC-02350: cannot equivalence this SQL type?
In this post, you’ll learn more about the Oracle ErrorPCC-02350: cannot equivalence this SQL type with the details on why you receive this error and the possible solution to fix it. Oracle Error Description PCC-02350: cannot equivalence this SQL type Reason for the Error PCC-02350: cannot equivalence this SQL type Cause: Datatype or variable equivalencing to the datatypes NUMBER or DECIMAL cannot be used. See…
How to fix the Oracle error PLS-00321: expression ‘string’ is inappropriate as the left hand side of an assignment statement?
In this post, you’ll learn more about the Oracle ErrorPLS-00321: expression ‘string’ is inappropriate as the left hand side of an assignment statement with the details on why you receive this error and the possible solution to fix it. Oracle Error Description PLS-00321: expression ‘string’ is inappropriate as the left hand side of an assignment statement Reason for the Error PLS-00321: expression ‘string’ is inappropriate…
How to fix the Oracle error RMAN-06250: Report of files that need backup due to unrecoverable operations?
In this post, you’ll learn more about the Oracle ErrorRMAN-06250: Report of files that need backup due to unrecoverable operations with the details on why you receive this error and the possible solution to fix it. Oracle Error Description RMAN-06250: Report of files that need backup due to unrecoverable operations Reason for the Error RMAN-06250: Report of files that need backup due to unrecoverable operations…
How to fix the Oracle error ORA-15510: cannot perform operation when “STATISTICS_LEVEL” is “BASIC”?
In this post, you’ll learn more about the Oracle ErrorORA-15510: cannot perform operation when “STATISTICS_LEVEL” is “BASIC” with the details on why you receive this error and the possible solution to fix it. Oracle Error Description ORA-15510: cannot perform operation when “STATISTICS_LEVEL” is “BASIC” Reason for the Error ORA-15510: cannot perform operation when “STATISTICS_LEVEL” is “BASIC” The STATISTICS_LEVEL initialization parameter was set to BASIC. How…
SQL Server Error Code – 14053 the subscription could not be updated at
In this blog post, you’ll learn more about the SQL Server Error Code 14053 and the error message description that is shown SQL Server Error Code 14053 SQL Server Error Description for the Code :14053 The subscription could not be updated at this time.
SQL Server Error Code – 6258 function signature of “fillrow” method (
In this blog post, you’ll learn more about the SQL Server Error Code 6258 and the error message description that is shown SQL Server Error Code 6258 SQL Server Error Description for the Code :6258 Function signature of “FillRow” method (as designated by SqlFunctionAttribute.FillRowMethodName) does not match SQL declaration for table valued CLR function’%.*ls’ due to column %d.
InterSystems IRIS General Error Code – 1618
In this post, you’ll learn about the General error code 1618 in InterSystems IRIS database the reason why you are receiving the error message when using the InterSystems IRIS data platform Error Code : 1618 Reason for the Error code 1618 in InterSystems IRIS DBMS Routines are already split from namespace %1
Windows Blue Screen of Death Error 0x00000048 – CANCEL_STATE_IN_COMPLETED_IRP
In this post, you’ll learn about the Blue Screen of Death (BSOD) or Stop Error 0x00000048-CANCEL_STATE_IN_COMPLETED_IRP and the reason why you are receiving the error message in Windows 10 or Windows 11 How does this BSOD Error Message in Windows Looks like 0x00000048 – CANCEL_STATE_IN_COMPLETED_IRP Why do you receive the Error 0x00000048 CANCEL_STATE_IN_COMPLETED_IRP in Windows? This BSOD means that an I/O request packet (IRP) was…
InterSystems Cache & Ensemble Error 6079 – The class ‘%1’ is not a valid Studio extension class.
In this blog post, let’s learn about the error message “6079 The class ‘%1’ is not a valid Studio extension class.” in InterSystems Cache & Ensemble and the description of the error message. Error Message 6079 – The class ‘%1’ is not a valid Studio extension class. Error Details The class ‘%1’ is not a valid Studio extension class.
InterSystems Cache & Ensemble Error 1215 – Deactivating encryption key is NOT allowed when the encrypte
In this blog post, let’s learn about the error message “1215 Deactivating encryption key is NOT allowed when the encrypte” in InterSystems Cache & Ensemble and the description of the error message. Error Message 1215 – Deactivating encryption key is NOT allowed when the encrypte Error Details Deactivating encryption key is NOT allowed when the encrypted journal file ‘%1’ contains open transactions
Ingress DB Error -40100 Cardinality violation
In this blog post, let’s learn about the error message “-40100 Cardinality violation” in Ingress DB and the description of the error message. Error Message -40100 – Cardinality violation Error Details A request tried to return more or fewer rows than allowed. This usually occurs when a singleton select request returns more than one row, or when a nested subquery returns an incorrect number of…
InfoSphere Information Server Error – DSJE_DELPROJFILESFAILED – -125
In this post, you’ll learn more about the Error DSJE_DELPROJFILESFAILED – -125that is returned when working with the InfoSphere Information Server InfoSphere Information Server DSJE_DELPROJFILESFAILED Error Description Failed to delete project files.
IBM TS4500 Tape Library Error – Accessor {ACCESSOR} Y motion required excessive force to move up. – 4685
In this post, you’ll learn more about the Error Accessor {ACCESSOR} Y motion required excessive force to move up. – 4685that is returned when working with the IBM TS4500 Tape Library IBM TS4500 Tape Library Error Accessor {ACCESSOR} Y motion required excessive force to move up. Error Description Accessor {ACCESSOR} Y motion required excessive force to move up.
IBM FlashSystem V9000 Error – 2305 – 087036
In this post, you’ll learn more about the Error 2305 – 087036that is returned when working with the IBM FlashSystem V9000 IBM FlashSystem V9000 Error Code 2305 Error Description No permission to use cloud snapshot delete operation
Win32 COM Error – XENROLL_E_RESPONSE_KA_HASH_NOT_FOUND – 0x80095002
In this post, you’ll learn more about the Error XENROLL_E_RESPONSE_KA_HASH_NOT_FOUND – 0x80095002 that is returned when working with the COM-based APIs in Win32 Win32 COM Error XENROLL_E_RESPONSE_KA_HASH_NOT_FOUND – 0x80095002 Win32 COM Error Error Description The key archival hash attribute was not found in the response.
MariaDB Error 1763 – ER_SQLTHREAD_WITH_SECURE_SLAVE
In this post, you’ll learn more about the MariaDB Error 1763 ER_SQLTHREAD_WITH_SECURE_SLAVE with the details of the error message and why you receive this error Maria DB Error Description MariaDB Error 1763 – ER_SQLTHREAD_WITH_SECURE_SLAVE with the sqlState HY000 Error Description for the MariaDB Error ER_SQLTHREAD_WITH_SECURE_SLAVE Setting authentication options is not possible when only the Slave SQL Thread is being started.