Category: Oracle
How to fix the Oracle error ORA-23502: valid directory for offline instatiation is not specified?
In this post, you’ll learn more about the Oracle ErrorORA-23502: valid directory for offline instatiation is not specified with the details on why you receive this error and the possible solution to fix it. Oracle Error Description ORA-23502: valid directory for offline instatiation is not specified Reason for the Error ORA-23502: valid directory for offline instatiation is not specified An attempt was made to offline…
How to fix the Oracle error ORA-02431: cannot disable constraint (string) – no such constraint?
In this post, you’ll learn more about the Oracle ErrorORA-02431: cannot disable constraint (string) – no such constraint with the details on why you receive this error and the possible solution to fix it. Oracle Error Description ORA-02431: cannot disable constraint (string) – no such constraint Reason for the Error ORA-02431: cannot disable constraint (string) – no such constraint the named constraint does not exist…
How to fix the Oracle error ORA-03203: concurrent update activity makes space analysis impossible?
In this post, you’ll learn more about the Oracle ErrorORA-03203: concurrent update activity makes space analysis impossible with the details on why you receive this error and the possible solution to fix it. Oracle Error Description ORA-03203: concurrent update activity makes space analysis impossible Reason for the Error ORA-03203: concurrent update activity makes space analysis impossible high volume of user updates interfere with the space…
How to fix the Oracle error ORA-07483: snlkget: cannot convert(get) lock.?
In this post, you’ll learn more about the Oracle ErrorORA-07483: snlkget: cannot convert(get) lock. with the details on why you receive this error and the possible solution to fix it. Oracle Error Description ORA-07483: snlkget: cannot convert(get) lock. Reason for the Error ORA-07483: snlkget: cannot convert(get) lock. lm_convert failed to convert(get) lock. How to fix the Error ORA-07483: snlkget: cannot convert(get) lock. ? You can…
How to fix the Oracle error NZE-29155: continuous key pair consistency check self-test failure?
In this post, you’ll learn more about the Oracle ErrorNZE-29155: continuous key pair consistency check self-test failure with the details on why you receive this error and the possible solution to fix it. Oracle Error Description NZE-29155: continuous key pair consistency check self-test failure Reason for the Error NZE-29155: continuous key pair consistency check self-test failure The public-private key pair check test failed. How to…
How to fix the Oracle error ORA-37521: (HASHSCAN00) Dimension string contains duplicate values. Please contact Oracle OLAP Technical Support.?
In this post, you’ll learn more about the Oracle ErrorORA-37521: (HASHSCAN00) Dimension string contains duplicate values. Please contact Oracle OLAP Technical Support. with the details on why you receive this error and the possible solution to fix it. Oracle Error Description ORA-37521: (HASHSCAN00) Dimension string contains duplicate values. Please contact Oracle OLAP Technical Support. Reason for the Error ORA-37521: (HASHSCAN00) Dimension string contains duplicate values….
How to fix the Oracle error DIA-48106: error initializing the ADR string object?
In this post, you’ll learn more about the Oracle ErrorDIA-48106: error initializing the ADR string object with the details on why you receive this error and the possible solution to fix it. Oracle Error Description DIA-48106: error initializing the ADR string object Reason for the Error DIA-48106: error initializing the ADR string object There was an error encountered during the initialization of one of the…
How to fix the Oracle error OCI-22153: source variable-length array is not initialized?
In this post, you’ll learn more about the Oracle ErrorOCI-22153: source variable-length array is not initialized with the details on why you receive this error and the possible solution to fix it. Oracle Error Description OCI-22153: source variable-length array is not initialized Reason for the Error OCI-22153: source variable-length array is not initialized The variable-length array on the left-hand-side of an assignment or the source…
How to fix the Oracle error ORA-29918: cannot create domain indexes on temporary tables?
In this post, you’ll learn more about the Oracle ErrorORA-29918: cannot create domain indexes on temporary tables with the details on why you receive this error and the possible solution to fix it. Oracle Error Description ORA-29918: cannot create domain indexes on temporary tables Reason for the Error ORA-29918: cannot create domain indexes on temporary tables An attempt was made to create a domain index…
How to fix the Oracle error SQL*Loader-00804: SEQUENCES with intervals are not supported by External Table Load.?
In this post, you’ll learn more about the Oracle ErrorSQL*Loader-00804: SEQUENCES with intervals are not supported by External Table Load. with the details on why you receive this error and the possible solution to fix it. Oracle Error Description SQL*Loader-00804: SEQUENCES with intervals are not supported by External Table Load. Reason for the Error SQL*Loader-00804: SEQUENCES with intervals are not supported by External Table Load….
How to fix the Oracle error CLST-02110: missing required parameter -nn with the list of nodenames?
In this post, you’ll learn more about the Oracle ErrorCLST-02110: missing required parameter -nn with the list of nodenames with the details on why you receive this error and the possible solution to fix it. Oracle Error Description CLST-02110: missing required parameter -nn with the list of nodenames Reason for the Error CLST-02110: missing required parameter -nn with the list of nodenames Cause: The -nn…
How to fix the Oracle error ORA-02229: invalid SIZE option value?
In this post, you’ll learn more about the Oracle ErrorORA-02229: invalid SIZE option value with the details on why you receive this error and the possible solution to fix it. Oracle Error Description ORA-02229: invalid SIZE option value Reason for the Error ORA-02229: invalid SIZE option value The specified value must be an integer number of bytes. How to fix the Error ORA-02229: invalid SIZE…
How to fix the Oracle error ORA-14609: Tablespace was not specified for the previous lob segments of column string in...
In this post, you’ll learn more about the Oracle ErrorORA-14609: Tablespace was not specified for the previous lob segments of column string in template but is specified for string with the details on why you receive this error and the possible solution to fix it. Oracle Error Description ORA-14609: Tablespace was not specified for the previous lob segments of column string in template but is…
How to fix the Oracle error ORA-15055: unable to connect to ASM instance?
In this post, you’ll learn more about the Oracle ErrorORA-15055: unable to connect to ASM instance with the details on why you receive this error and the possible solution to fix it. Oracle Error Description ORA-15055: unable to connect to ASM instance Reason for the Error ORA-15055: unable to connect to ASM instance The RDBMS instance was unable to connect to the required ASM instance…
How to fix the Oracle error TNS-12655: Password check failed?
In this post, you’ll learn more about the Oracle ErrorTNS-12655: Password check failed with the details on why you receive this error and the possible solution to fix it. Oracle Error Description TNS-12655: Password check failed Reason for the Error TNS-12655: Password check failed Cause: The authentication service being used was unable to verify the provided password. How to fix the Error TNS-12655: Password check…
How to fix the Oracle error PLS-00115: this PRAGMA must follow the declaration of ‘string’?
In this post, you’ll learn more about the Oracle ErrorPLS-00115: this PRAGMA must follow the declaration of ‘string’ with the details on why you receive this error and the possible solution to fix it. Oracle Error Description PLS-00115: this PRAGMA must follow the declaration of ‘string’ Reason for the Error PLS-00115: this PRAGMA must follow the declaration of ‘string’ The pragma refers to a PL/SQL…
How to fix the Oracle error LSX-00204: extra data at end of complex element?
In this post, you’ll learn more about the Oracle ErrorLSX-00204: extra data at end of complex element with the details on why you receive this error and the possible solution to fix it. Oracle Error Description LSX-00204: extra data at end of complex element Reason for the Error LSX-00204: extra data at end of complex element Cause: Extra nodes exist at the end of an…
How to fix the Oracle error ORA-31203: DBMS_LDAP: PL/SQL – Init Failed.?
In this post, you’ll learn more about the Oracle ErrorORA-31203: DBMS_LDAP: PL/SQL – Init Failed. with the details on why you receive this error and the possible solution to fix it. Oracle Error Description ORA-31203: DBMS_LDAP: PL/SQL – Init Failed. Reason for the Error ORA-31203: DBMS_LDAP: PL/SQL – Init Failed. There has been an error in the DBMS_LDAP Init operation. How to fix the Error…
How to fix the Oracle error ORA-32850: agent string does not exist?
In this post, you’ll learn more about the Oracle ErrorORA-32850: agent string does not exist with the details on why you receive this error and the possible solution to fix it. Oracle Error Description ORA-32850: agent string does not exist Reason for the Error ORA-32850: agent string does not exist The specified Messaging Gateway agent name did not exist. How to fix the Error ORA-32850:…
How to fix the Oracle error ORA-36995: (XSRELGID12) There are duplicate values in the surrogate dimension gid. Use the levelorder...
In this post, you’ll learn more about the Oracle ErrorORA-36995: (XSRELGID12) There are duplicate values in the surrogate dimension gid. Use the levelorder option to resolve the ambiguity. with the details on why you receive this error and the possible solution to fix it. Oracle Error Description ORA-36995: (XSRELGID12) There are duplicate values in the surrogate dimension gid. Use the levelorder option to resolve the…